Reaction Details
TargetAndrogen receptor
LigandBDBM50366558
Substrate/Competitorn/a
Meas. Tech.ChEMBL_36143 (CHEMBL648331)
Ki>100±n/a nM
Citation Hamann, LGFarmer, LJJohnson, MGBender, SLMais, DEWang, MWCrombie, DGoldman, MEJones, TK Synthesis and biological activity of novel nonsteroidal progesterone receptor antagonists based on cyclocymopol monomethyl ether. J Med Chem39:1778-89 (1996) 
 
Androgen receptor
Name:Androgen receptor
Type:Receptor
Mol. Mass.:99185.27
Organism:Homo sapiens (Human)
Description:CHO cells were stably transfected with human AR gene.
Residue:920
BDBM50366558
NameBDBM50366558
Synonyms:ONAPRISTONE | ZK-98299
TypeSmall organic molecule
Emp. Form.C29H39NO3
Mol. Mass.449.6249
SMILESCN(C)c1ccc(cc1)[C@H]1C[C@]2(C)[C@@H](CC[C@]2(O)CCCO)[C@@H]2CCC3=CC(=O)CCC3=C12