Reaction Details
TargetProgesterone receptor
LigandBDBM50049512
Substrate/Competitorn/a
Meas. Tech.ChEMBL_159855 (CHEMBL765832)
EC50 3264±n/a nM
Citation Hamann, LGFarmer, LJJohnson, MGBender, SLMais, DEWang, MWCrombie, DGoldman, MEJones, TK Synthesis and biological activity of novel nonsteroidal progesterone receptor antagonists based on cyclocymopol monomethyl ether. J Med Chem39:1778-89 (1996) 
 
Progesterone receptor
Name:Progesterone receptor
Type:Protein
Mol. Mass.:98979.52
Organism:Homo sapiens (Human)
Description:P06401
Residue:933
BDBM50049512
NameBDBM50049512
Synonyms:5-Bromo-2-((S)-2,2-dimethyl-6-methylene-cyclohexylmethyl)-4-methoxy-phenol | CHEMBL51669
TypeSmall organic molecule
Emp. Form.C17H23BrO2
Mol. Mass.339.267
SMILESCOc1cc(C[C@@H]2C(=C)CCCC2(C)C)c(O)cc1Br