Reaction Details
TargetProgesterone receptor
LigandBDBM50049505
Substrate/Competitorn/a
Meas. Tech.ChEMBL_159731 (CHEMBL766188)
Ki 29±n/a nM
Citation Hamann, LGFarmer, LJJohnson, MGBender, SLMais, DEWang, MWCrombie, DGoldman, MEJones, TK Synthesis and biological activity of novel nonsteroidal progesterone receptor antagonists based on cyclocymopol monomethyl ether. J Med Chem39:1778-89 (1996) 
 
Progesterone receptor
Name:Progesterone receptor
Type:Protein
Mol. Mass.:98979.52
Organism:Homo sapiens (Human)
Description:P06401
Residue:933
BDBM50049505
NameBDBM50049505
Synonyms:2-Methyl-1-nitro-4-(4,6,6-trimethyl-2-methylene-cyclohex-3-enylmethyl)-benzene | CHEMBL299512
TypeSmall organic molecule
Emp. Form.C18H23NO2
Mol. Mass.285.3807
SMILESCC1=CC(=C)C(Cc2ccc(c(C)c2)[N+]([O-])=O)C(C)(C)C1