Reaction Details
TargetProgesterone receptor
LigandBDBM50049502
Substrate/Competitorn/a
Meas. Tech.ChEMBL_159731 (CHEMBL766188)
Ki 441±n/a nM
Citation Hamann, LGFarmer, LJJohnson, MGBender, SLMais, DEWang, MWCrombie, DGoldman, MEJones, TK Synthesis and biological activity of novel nonsteroidal progesterone receptor antagonists based on cyclocymopol monomethyl ether. J Med Chem39:1778-89 (1996) 
 
Progesterone receptor
Name:Progesterone receptor
Type:Protein
Mol. Mass.:98979.52
Organism:Homo sapiens (Human)
Description:P06401
Residue:933
BDBM50049502
NameBDBM50049502
Synonyms:5-Bromo-2-(2,2-dimethyl-5-methylene-cyclopentylmethyl)-4-methoxy-phenol | CHEMBL48745
TypeSmall organic molecule
Emp. Form.C16H21BrO2
Mol. Mass.325.241
SMILESCOc1cc(CC2C(=C)CCC2(C)C)c(O)cc1Br