Reaction Details
TargetGlucocorticoid receptor
LigandBDBM50049512
Substrate/Competitorn/a
Meas. Tech.ChEMBL_71392 (CHEMBL681744)
Ki 1777±n/a nM
Citation Hamann, LGFarmer, LJJohnson, MGBender, SLMais, DEWang, MWCrombie, DGoldman, MEJones, TK Synthesis and biological activity of novel nonsteroidal progesterone receptor antagonists based on cyclocymopol monomethyl ether. J Med Chem39:1778-89 (1996) 
 
Glucocorticoid receptor
Name:Glucocorticoid receptor
Type:Enzyme
Mol. Mass.:85656.87
Organism:Homo sapiens (Human)
Description:P04150
Residue:777
BDBM50049512
NameBDBM50049512
Synonyms:5-Bromo-2-((S)-2,2-dimethyl-6-methylene-cyclohexylmethyl)-4-methoxy-phenol | CHEMBL51669
TypeSmall organic molecule
Emp. Form.C17H23BrO2
Mol. Mass.339.267
SMILESCOc1cc(C[C@@H]2C(=C)CCCC2(C)C)c(O)cc1Br