Reaction Details
TargetAndrogen receptor
LigandBDBM50049512
Substrate/Competitorn/a
Meas. Tech.ChEMBL_36141 (CHEMBL648329)
Ki 1099±n/a nM
Citation Hamann, LGFarmer, LJJohnson, MGBender, SLMais, DEWang, MWCrombie, DGoldman, MEJones, TK Synthesis and biological activity of novel nonsteroidal progesterone receptor antagonists based on cyclocymopol monomethyl ether. J Med Chem39:1778-89 (1996) 
 
Androgen receptor
Name:Androgen receptor
Type:Receptor
Mol. Mass.:99185.27
Organism:Homo sapiens (Human)
Description:CHO cells were stably transfected with human AR gene.
Residue:920
BDBM50049512
NameBDBM50049512
Synonyms:5-Bromo-2-((S)-2,2-dimethyl-6-methylene-cyclohexylmethyl)-4-methoxy-phenol | CHEMBL51669
TypeSmall organic molecule
Emp. Form.C17H23BrO2
Mol. Mass.339.267
SMILESCOc1cc(C[C@@H]2C(=C)CCCC2(C)C)c(O)cc1Br