Reaction Details
TargetNeutrophil elastase
LigandBDBM50058351
Substrate/Competitorn/a
Meas. Tech.ChEMBL_63997 (CHEMBL673106)
Ki 1.2±n/a nM
Citation Edwards, PDAndisik, DWBryant, CAEwing, BGomes, BLewis, JJRakiewicz, DSteelman, GStrimpler, ATrainor, DATuthill, PAMauger, RCVeale, CAWildonger, RAWilliams, JCWolanin, DJZottola, M Discovery and biological activity of orally active peptidyl trifluoromethyl ketone inhibitors of human neutrophil elastase. J Med Chem40:1876-85 (1997) 
 
Neutrophil elastase
Name:Neutrophil elastase
Type:Enzyme
Mol. Mass.:28532.38
Organism:Homo sapiens (Human)
Description:P08246
Residue:267
BDBM50058351
NameBDBM50058351
Synonyms:1-[(S)-2-(Adamantane-1-sulfonylamino)-3-methyl-butyryl]-pyrrolidine-2-carboxylic acid (3,3,3-trifluoro-1-isopropyl-2-oxo-propyl)-amide | CHEMBL293558
TypeSmall organic molecule
Emp. Form.C26H40F3N3O5S
Mol. Mass.563.673
SMILESCC(C)C(NC(=O)C1CCCN1C(=O)[C@@H](NS(=O)(=O)C12CC3CC(CC(C3)C1)C2)C(C)C)C(=O)C(F)(F)F