Reaction Details
TargetNeutrophil elastase
LigandBDBM50058359
Substrate/Competitorn/a
Meas. Tech.ChEMBL_63997 (CHEMBL673106)
Ki 1.8±n/a nM
Citation Edwards, PDAndisik, DWBryant, CAEwing, BGomes, BLewis, JJRakiewicz, DSteelman, GStrimpler, ATrainor, DATuthill, PAMauger, RCVeale, CAWildonger, RAWilliams, JCWolanin, DJZottola, M Discovery and biological activity of orally active peptidyl trifluoromethyl ketone inhibitors of human neutrophil elastase. J Med Chem40:1876-85 (1997) 
 
Neutrophil elastase
Name:Neutrophil elastase
Type:Enzyme
Mol. Mass.:28532.38
Organism:Homo sapiens (Human)
Description:P08246
Residue:267
BDBM50058359
NameBDBM50058359
Synonyms:4-((E)-2-{(S)-2-Methyl-1-[2-(3,3,3-trifluoro-1-isopropyl-2-oxo-propylcarbamoyl)-pyrrolidine-1-carbonyl]-propylcarbamoyl}-vinyl)-benzoic acid | CHEMBL418117
TypeSmall organic molecule
Emp. Form.C26H32F3N3O6
Mol. Mass.539.544
SMILESCC(C)[C@H](NC(=O)\C=C\c1ccc(cc1)C(O)=O)C(=O)N1CCCC1C(=O)NC(C(C)C)C(=O)C(F)(F)F