Reaction Details
TargetNeutrophil elastase
LigandBDBM50058355
Substrate/Competitorn/a
Meas. Tech.ChEMBL_63997 (CHEMBL673106)
Ki 6.1±n/a nM
Citation Edwards, PDAndisik, DWBryant, CAEwing, BGomes, BLewis, JJRakiewicz, DSteelman, GStrimpler, ATrainor, DATuthill, PAMauger, RCVeale, CAWildonger, RAWilliams, JCWolanin, DJZottola, M Discovery and biological activity of orally active peptidyl trifluoromethyl ketone inhibitors of human neutrophil elastase. J Med Chem40:1876-85 (1997) 
 
Neutrophil elastase
Name:Neutrophil elastase
Type:Enzyme
Mol. Mass.:28532.38
Organism:Homo sapiens (Human)
Description:P08246
Residue:267
BDBM50058355
NameBDBM50058355
Synonyms:1-{(S)-3-Methyl-2-[4-(naphthalene-1-sulfonylamino)-4-oxo-butyrylamino]-butyryl}-pyrrolidine-2-carboxylic acid (3,3,3-trifluoro-1-isopropyl-2-oxo-propyl)-amide | CHEMBL291309
TypeSmall organic molecule
Emp. Form.C30H37F3N4O7S
Mol. Mass.654.698
SMILESCC(C)[C@H](NC(=O)CCC(=O)NS(=O)(=O)c1cccc2ccccc12)C(=O)N1CCCC1C(=O)NC(C(C)C)C(=O)C(F)(F)F