Reaction Details
TargetNeutrophil elastase
LigandBDBM50058392
Substrate/Competitorn/a
Meas. Tech.ChEMBL_63997 (CHEMBL673106)
Ki 2.7±n/a nM
Citation Edwards, PDAndisik, DWBryant, CAEwing, BGomes, BLewis, JJRakiewicz, DSteelman, GStrimpler, ATrainor, DATuthill, PAMauger, RCVeale, CAWildonger, RAWilliams, JCWolanin, DJZottola, M Discovery and biological activity of orally active peptidyl trifluoromethyl ketone inhibitors of human neutrophil elastase. J Med Chem40:1876-85 (1997) 
 
Neutrophil elastase
Name:Neutrophil elastase
Type:Enzyme
Mol. Mass.:28532.38
Organism:Homo sapiens (Human)
Description:P08246
Residue:267
BDBM50058392
NameBDBM50058392
Synonyms:1-[(S)-3-Methyl-2-(naphthalene-2-sulfonylamino)-butyryl]-pyrrolidine-2-carboxylic acid (3,3,3-trifluoro-1-isopropyl-2-oxo-propyl)-amide | CHEMBL55726
TypeSmall organic molecule
Emp. Form.C26H32F3N3O5S
Mol. Mass.555.61
SMILESCC(C)C(NC(=O)C1CCCN1C(=O)[C@@H](NS(=O)(=O)c1ccc2ccccc2c1)C(C)C)C(=O)C(F)(F)F