Reaction Details
TargetMu-type opioid receptor
LigandBDBM50058660
Substrate/Competitorn/a
Meas. Tech.ChEMBL_148397 (CHEMBL759359)
Ki 28±n/a nM
Citation Farouz-Grant, FPortoghese, PS Pyrrolomorphinans as delta opioid receptor antagonists. The role of steric hindrance in conferring selectivity. J Med Chem40:1977-81 (1997) 
 
Mu-type opioid receptor
Name:Mu-type opioid receptor
Type:Enzyme Catalytic Domain
Mol. Mass.:44431.62
Organism:MOUSE
Description:OPIATE Mu OPRM1 MOUSE::P42866
Residue:398
BDBM50058660
NameBDBM50058660
Synonyms:5-benzyl-18-cyclopropylmethyl-6-methyl-10-oxa-7,18-diazahexacyclo[9.9.1.01,9.02,17.04,8.015,21]henicosa-4(8),5,11,13,15(21)-pentaene-2,12-diol | CHEMBL60407
TypeSmall organic molecule
Emp. Form.C30H32N2O3
Mol. Mass.468.5867
SMILESCc1[nH]c2[C@@H]3Oc4c5c(CC6N(CC7CC7)CCC35[C@@]6(O)Cc2c1Cc1ccccc1)ccc4O