Reaction Details
TargetSomatostatin receptor type 3
LigandBDBM50272772
Substrate/Competitorn/a
Meas. Tech.ChEMBL_200510 (CHEMBL803854)
IC50 3±n/a nM
Citation Osapay, GProkai, LKim, HSMedzihradszky, KFCoy, DHLiapakis, GReisine, TMelacini, GZhu, QWang, SHMattern, RHGoodman, M Lanthionine-somatostatin analogs: synthesis, characterization, biological activity, and enzymatic stability studies. J Med Chem40:2241-51 (1997) 
 
Somatostatin receptor type 3
Name:Somatostatin receptor type 3
Type:Enzyme Catalytic Domain
Mol. Mass.:47225.49
Organism:MOUSE
Description:SOMATOSTATIN SST3 SSTR3 MOUSE::P30935
Residue:428
BDBM50272772
NameBDBM50272772
Synonyms:10-(4-Amino-butyl)-19-(2-amino-3-phenyl-propionylamino)-16-benzyl-7-(1-hydroxy-ethyl)-13-(1H-indol-3-ylmethyl)-6,9,12,15,18-pentaoxo-1,2-dithia-5,8,11,14,17-pentaaza-cycloicosane-4-carboxylic acid (2-hydroxy-1- 2-{[(13R,16S,19R)-10-(4-Amino-butyl)-19-((S)-2-amino-3-phenyl-propionylamino)-16-benzyl-7-(1-hydroxy-ethyl)-13-(1H-indol-3-ylmethyl)-6,9,12,15,18-pentaoxo-1,2-dithia-5,8,11,14,17-pentaaza-cycloicosane-4-carbonyl]-amino}-3-hydroxy-butyric acid OCTREOTIDE
TypeSmall organic molecule
Emp. Form.C49H66N10O10S2
Mol. Mass.1019.239
SMILESC[C@@H](O)[C@@H](CO)NC(=O)[C@@H]1CSSC[C@H](NC(=O)[C@H](N)Cc2ccccc2)C(=O)N[C@@H](Cc2ccccc2)C(=O)N[C@H](Cc2c[nH]c3ccccc23)C(=O)N[C@@H](CCCCN)C(=O)N[C@@H]([C@@H](C)O)C(=O)N1