Reaction Details
TargetSomatostatin receptor type 5
LigandBDBM50059089
Substrate/Competitorn/a
Meas. Tech.ChEMBL_200526 (CHEMBL806596)
IC50 4.9±n/a nM
Citation Osapay, GProkai, LKim, HSMedzihradszky, KFCoy, DHLiapakis, GReisine, TMelacini, GZhu, QWang, SHMattern, RHGoodman, M Lanthionine-somatostatin analogs: synthesis, characterization, biological activity, and enzymatic stability studies. J Med Chem40:2241-51 (1997) 
 
Somatostatin receptor type 5
Name:Somatostatin receptor type 5
Type:Enzyme
Mol. Mass.:39218.02
Organism:Homo sapiens (Human)
Description:P35346
Residue:364
BDBM50059089
NameBDBM50059089
Synonyms:9-(4-Amino-butyl)-18-(2-amino-3-phenyl-propionylamino)-15-benzyl-6-(1-hydroxy-ethyl)-12-(1H-indol-3-ylmethyl)-5,8,11,14,17-pentaoxo-1-thia-4,7,10,13,16-pentaaza-cyclononadecane-3-carboxylic acid (1-carbamoyl-2-hydroxy-propyl)-amide | CHEMBL436783
TypeSmall organic molecule
Emp. Form.C49H65N11O10S
Mol. Mass.1000.173
SMILESC[C@@H](O)[C@H](NC(=O)[C@@H]1CSC[C@@H](NC(=O)[C@H](N)Cc2ccccc2)C(=O)N[C@H](Cc2ccccc2)C(=O)N[C@@H](Cc2c[nH]c3ccccc23)C(=O)N[C@H](CCCCN)C(=O)N[C@@H]([C@@H](C)O)C(=O)N1)C(N)=O