Reaction Details
TargetSomatostatin receptor type 2
LigandBDBM50059087
Substrate/Competitorn/a
Meas. Tech.ChEMBL_200501 (CHEMBL803846)
IC50>1000±n/a nM
Citation Osapay, GProkai, LKim, HSMedzihradszky, KFCoy, DHLiapakis, GReisine, TMelacini, GZhu, QWang, SHMattern, RHGoodman, M Lanthionine-somatostatin analogs: synthesis, characterization, biological activity, and enzymatic stability studies. J Med Chem40:2241-51 (1997) 
 
Somatostatin receptor type 2
Name:Somatostatin receptor type 2
Type:Enzyme Catalytic Domain
Mol. Mass.:41234.26
Organism:MOUSE
Description:SOMATOSTATIN SST2 SSTR2 MOUSE::P30875
Residue:369
BDBM50059087
NameBDBM50059087
Synonyms:(3R,6S,9R,12S,15R,18S)-9-(4-Amino-butyl)-18-((R)-2-amino-3-phenyl-propionylamino)-15-benzyl-6-((R)-1-hydroxy-ethyl)-12-(1H-indol-3-ylmethyl)-5,8,11,14,17-pentaoxo-1-thia-4,7,10,13,16-pentaaza-cyclononadecane-3-carboxylic acid | CHEMBL69379
TypeSmall organic molecule
Emp. Form.C45H57N9O9S
Mol. Mass.900.054
SMILESC[C@@H](O)[C@@H]1NC(=O)[C@@H](CCCCN)NC(=O)[C@H](Cc2c[nH]c3ccccc23)NC(=O)[C@@H](Cc2ccccc2)NC(=O)[C@@H](CSC[C@H](NC1=O)C(O)=O)NC(=O)[C@H](N)Cc1ccccc1