Reaction Details
TargetSomatostatin receptor type 5
LigandBDBM50059091
Substrate/Competitorn/a
Meas. Tech.ChEMBL_200533 (CHEMBL806603)
IC50 1.3±n/a nM
Citation Osapay, GProkai, LKim, HSMedzihradszky, KFCoy, DHLiapakis, GReisine, TMelacini, GZhu, QWang, SHMattern, RHGoodman, M Lanthionine-somatostatin analogs: synthesis, characterization, biological activity, and enzymatic stability studies. J Med Chem40:2241-51 (1997) 
 
Somatostatin receptor type 5
Name:Somatostatin receptor type 5
Type:Enzyme Catalytic Domain
Mol. Mass.:39986.50
Organism:RAT
Description:SOMATOSTATIN SST5 SSTR5 RAT::P30938
Residue:363
BDBM50059091
NameBDBM50059091
Synonyms:2-{[9-(4-Amino-butyl)-18-(2-amino-3-phenyl-propionylamino)-15-benzyl-6-(1-hydroxy-ethyl)-12-(1H-indol-3-ylmethyl)-5,8,11,14,17-pentaoxo-1-thia-4,7,10,13,16-pentaaza-cyclononadecane-3-carbonyl]-amino}-3-hydroxy-butyric acid | CHEMBL266469
TypeSmall organic molecule
Emp. Form.C49H64N10O11S
Mol. Mass.1001.158
SMILESC[C@@H](O)[C@H](NC(=O)[C@@H]1CSC[C@@H](NC(=O)[C@H](N)Cc2ccccc2)C(=O)N[C@H](Cc2ccccc2)C(=O)N[C@@H](Cc2c[nH]c3ccccc23)C(=O)N[C@H](CCCCN)C(=O)N[C@@H]([C@@H](C)O)C(=O)N1)C(O)=O