Reaction Details
TargetSomatostatin receptor type 5
LigandBDBM50059088
Substrate/Competitorn/a
Meas. Tech.ChEMBL_200533 (CHEMBL806603)
IC50 500±n/a nM
Citation Osapay, GProkai, LKim, HSMedzihradszky, KFCoy, DHLiapakis, GReisine, TMelacini, GZhu, QWang, SHMattern, RHGoodman, M Lanthionine-somatostatin analogs: synthesis, characterization, biological activity, and enzymatic stability studies. J Med Chem40:2241-51 (1997) 
 
Somatostatin receptor type 5
Name:Somatostatin receptor type 5
Type:Enzyme Catalytic Domain
Mol. Mass.:39986.50
Organism:RAT
Description:SOMATOSTATIN SST5 SSTR5 RAT::P30938
Residue:363
BDBM50059088
NameBDBM50059088
Synonyms:(3S,6R,9S,12R,15S,18R)-18-Amino-9-(4-amino-butyl)-15-benzyl-6-((R)-1-hydroxy-ethyl)-12-(1H-indol-3-ylmethyl)-5,8,11,14,17-pentaoxo-1-thia-4,7,10,13,16-pentaaza-cyclononadecane-3-carboxylic acid | CHEMBL306702
TypeSmall organic molecule
Emp. Form.C36H48N8O8S
Mol. Mass.752.88
SMILESC[C@@H](O)[C@H]1NC(=O)[C@H](CCCCN)NC(=O)[C@@H](Cc2c[nH]c3ccccc23)NC(=O)[C@H](Cc2ccccc2)NC(=O)[C@@H](N)CSC[C@@H](NC1=O)C(O)=O