Reaction Details
TargetInosine-5'-monophosphate dehydrogenase 2
LigandBDBM50421763
Substrate/Competitorn/a
Meas. Tech.ChEMBL_89934 (CHEMBL699560)
IC50 90±n/a nM
Citation Lesiak, KWatanabe, KAMajumdar, ASeidman, MVanderveen, KGoldstein, BMPankiewicz, KW Synthesis of nonhydrolyzable analogues of thiazole-4-carboxamide and benzamide adenine dinucleotide containing fluorine atom at the C2' of adenine nucleoside: induction of K562 differentiation and inosine monophosphate dehydrogenase inhibitory activity. J Med Chem40:2533-8 (1997) 
 
Inosine-5'-monophosphate dehydrogenase 2
Name:Inosine-5'-monophosphate dehydrogenase 2
Type:Enzyme
Mol. Mass.:55806.87
Organism:Homo sapiens (Human)
Description:Recombinant IMPDH2 expressed in E. coli.
Residue:514
BDBM50421763
NameBDBM50421763
Synonyms:CHEMBL2364562
TypeSmall organic molecule
Emp. Form.C19H25N7O14P2S
Mol. Mass.669.453
SMILESNC(=O)c1csc(n1)[C@H]1O[C@@H](COP(O)(=O)OP(O)(=O)OC[C@H]2O[C@H]([C@H](O)[C@@H]2O)n2cnc3c(N)ncnc23)[C@H](O)[C@@H]1O