Reaction Details
TargetGeranylgeranyl transferase type-1 subunit beta/Protein farnesyltransferase/geranylgeranyltransferase type-1 subunit alpha
LigandBDBM50059870
Substrate/Competitorn/a
Meas. Tech.ChEMBL_71818 (CHEMBL683649)
IC50 50±n/a nM
Citation Leonard, DM Ras farnesyltransferase: a new therapeutic target. J Med Chem40:2971-90 (1997) 
 
Geranylgeranyl transferase type-1 subunit beta/Protein farnesyltransferase/geranylgeranyltransferase type-1 subunit alpha
Name:Geranylgeranyl transferase type-1 subunit beta/Protein farnesyltransferase/geranylgeranyltransferase type-1 subunit alpha
Type:n/a
Mol. Mass.:n/a
Description:ASSAY_ID of EBI is 70196
Components:This complex has 2 components.
Component 1
Name:Protein farnesyltransferase/geranylgeranyltransferase type-1 subunit alpha
Synonyms:CAAX farnesyltransferase alpha subunit FNTA_HUMAN FTase-alpha Geranylgeranyl Transferase (GGTase-I) Chain A Protein Farnesyltransferase (PFT) Chain A Protein farnesyltransferase Protein farnesyltransferase/geranylgeranyltransferase type I alpha subunit | Ras proteins prenyltransferase alpha
Type:Enzyme
Mol. Mass.:44392.46
Organism:Homo sapiens (Human)
Description:Recombinant human FTase.
Residue:379
Component 2
Name:Geranylgeranyl transferase type-1 subunit beta
Synonyms:2.5.1.59 Geranylgeranyl transferase type I Geranylgeranyl transferase type I subunit beta PGGT1B Protein farnesyl/geranylgeranyl transferase | Type I protein geranyl-geranyltransferase subunit beta
Type:n/a
Mol. Mass.:42369.84
Organism:Homo sapiens (Human)
Description:n/a
Residue:377
BDBM50059870
NameBDBM50059870
Synonyms:(R)-2-({4-[((R)-2-Amino-3-mercapto-propylamino)-methyl]-biphenyl-2-carbonyl}-amino)-3-methylsulfanyl-propionic acid | CHEMBL319274
TypeSmall organic molecule
Emp. Form.C21H27N3O3S2
Mol. Mass.433.587
SMILESCSC[C@H](NC(=O)c1cc(CNC[C@@H](N)CS)ccc1-c1ccccc1)C(O)=O