Reaction Details
TargetAnionic trypsin
LigandBDBM50060025
Substrate/Competitorn/a
Meas. Tech.ChEMBL_212519 (CHEMBL817584)
Ki 220±n/a nM
Citation Stürzebecher, JPrasa, DHauptmann, JVieweg, HWikström, P Synthesis and structure-activity relationships of potent thrombin inhibitors: piperazides of 3-amidinophenylalanine. J Med Chem40:3091-9 (1997) 
 
Anionic trypsin
Name:Anionic trypsin
Type:PROTEIN
Mol. Mass.:26281.39
Organism:Bos taurus
Description:ChEMBL_212177
Residue:247
BDBM50060025
NameBDBM50060025
Synonyms:3-{2-(Naphthalene-2-sulfonylamino)-3-oxo-3-[4-(toluene-4-sulfonyl)-piperazin-1-yl]-propyl}-benzamidine | CHEMBL106718
TypeSmall organic molecule
Emp. Form.C31H33N5O5S2
Mol. Mass.619.754
SMILESCc1ccc(cc1)S(=O)(=O)N1CCN(CC1)C(=O)C(Cc1cccc(c1)C(N)=N)NS(=O)(=O)c1ccc2ccccc2c1