Reaction Details
TargetCoagulation factor XII
LigandBDBM50060029
Substrate/Competitorn/a
Meas. Tech.ChEMBL_49154 (CHEMBL663254)
Ki 200000±n/a nM
Citation Stürzebecher, JPrasa, DHauptmann, JVieweg, HWikström, P Synthesis and structure-activity relationships of potent thrombin inhibitors: piperazides of 3-amidinophenylalanine. J Med Chem40:3091-9 (1997) 
 
Coagulation factor XII
Name:Coagulation factor XII
Type:Enzyme
Mol. Mass.:67810.07
Organism:Homo sapiens (Human)
Description:P00748
Residue:615
BDBM50060029
NameBDBM50060029
Synonyms:3-[(R)-3-(4-Acetyl-piperazin-1-yl)-2-(naphthalene-2-sulfonylamino)-3-oxo-propyl]-benzamidine | CHEMBL322901
TypeSmall organic molecule
Emp. Form.C26H29N5O4S
Mol. Mass.507.605
SMILESCC(=O)N1CCN(CC1)C(=O)[C@@H](Cc1cccc(c1)C(N)=N)NS(=O)(=O)c1ccc2ccccc2c1