Reaction Details
TargetProthrombin
LigandBDBM50060044
Substrate/Competitorn/a
Meas. Tech.ChEMBL_210595 (CHEMBL816562)
Ki 350±n/a nM
Citation Stürzebecher, JPrasa, DHauptmann, JVieweg, HWikström, P Synthesis and structure-activity relationships of potent thrombin inhibitors: piperazides of 3-amidinophenylalanine. J Med Chem40:3091-9 (1997) 
 
Prothrombin
Name:Prothrombin
Type:Enzyme
Mol. Mass.:70502.73
Organism:Bos taurus (Bovine)
Description:P00735
Residue:625
BDBM50060044
NameBDBM50060044
Synonyms:3-[3-[4-(Butane-1-sulfonyl)-piperazin-1-yl]-2-(naphthalene-2-sulfonylamino)-3-oxo-propyl]-benzamidine | CHEMBL322404
TypeSmall organic molecule
Emp. Form.C28H35N5O5S2
Mol. Mass.585.738
SMILESCCCCS(=O)(=O)N1CCN(CC1)C(=O)C(Cc1cccc(c1)C(N)=N)NS(=O)(=O)c1ccc2ccccc2c1