Reaction Details
TargetAnionic trypsin
LigandBDBM50060016
Substrate/Competitorn/a
Meas. Tech.ChEMBL_212519 (CHEMBL817584)
Ki 22±n/a nM
Citation Stürzebecher, JPrasa, DHauptmann, JVieweg, HWikström, P Synthesis and structure-activity relationships of potent thrombin inhibitors: piperazides of 3-amidinophenylalanine. J Med Chem40:3091-9 (1997) 
 
Anionic trypsin
Name:Anionic trypsin
Type:PROTEIN
Mol. Mass.:26281.39
Organism:Bos taurus
Description:ChEMBL_212177
Residue:247
BDBM50060016
NameBDBM50060016
Synonyms:4-[3-(3-Carbamimidoyl-phenyl)-2-(naphthalene-2-sulfonylamino)-propionyl]-piperazine-1-carboxylic acid ethyl ester | CHEMBL322437
TypeSmall organic molecule
Emp. Form.C27H31N5O5S
Mol. Mass.537.631
SMILESCCOC(=O)N1CCN(CC1)C(=O)C(Cc1cccc(c1)C(N)=N)NS(=O)(=O)c1ccc2ccccc2c1