Reaction Details
TargetPlasminogen
LigandBDBM50060063
Substrate/Competitorn/a
Meas. Tech.ChEMBL_155250 (CHEMBL764739)
Ki 18000±n/a nM
Citation Stürzebecher, JPrasa, DHauptmann, JVieweg, HWikström, P Synthesis and structure-activity relationships of potent thrombin inhibitors: piperazides of 3-amidinophenylalanine. J Med Chem40:3091-9 (1997) 
 
Plasminogen
Name:Plasminogen
Type:Enzyme
Mol. Mass.:90579.18
Organism:Homo sapiens (Human)
Description:n/a
Residue:810
BDBM50060063
NameBDBM50060063
Synonyms:3-[3-(4-Methanesulfonyl-piperazin-1-yl)-2-(4-methoxy-2,3,6-trimethyl-benzenesulfonylamino)-3-oxo-propyl]-benzamidine | CHEMBL105439
TypeSmall organic molecule
Emp. Form.C25H35N5O6S2
Mol. Mass.565.705
SMILESCOc1cc(C)c(c(C)c1C)S(=O)(=O)NC(Cc1cccc(c1)C(N)=N)C(=O)N1CCN(CC1)S(C)(=O)=O