Reaction Details
TargetCoagulation factor X
LigandBDBM50060057
Substrate/Competitorn/a
Meas. Tech.ChEMBL_48481 (CHEMBL662059)
Ki 25000±n/a nM
Citation Stürzebecher, JPrasa, DHauptmann, JVieweg, HWikström, P Synthesis and structure-activity relationships of potent thrombin inhibitors: piperazides of 3-amidinophenylalanine. J Med Chem40:3091-9 (1997) 
 
Coagulation factor X
Name:Coagulation factor X
Type:PROTEIN
Mol. Mass.:54498.45
Organism:Bos taurus
Description:ChEMBL_1364435
Residue:492
BDBM50060057
NameBDBM50060057
Synonyms:3-{2-(Naphthalene-2-sulfonylamino)-3-[4-(naphthalene-2-sulfonyl)-piperazin-1-yl]-3-oxo-propyl}-benzamidine | CHEMBL320937
TypeSmall organic molecule
Emp. Form.C34H33N5O5S2
Mol. Mass.655.786
SMILESNC(=N)c1cccc(CC(NS(=O)(=O)c2ccc3ccccc3c2)C(=O)N2CCN(CC2)S(=O)(=O)c2ccc3ccccc3c2)c1