Reaction Details
TargetPlasminogen
LigandBDBM50060051
Substrate/Competitorn/a
Meas. Tech.ChEMBL_155250 (CHEMBL764739)
Ki 8400±n/a nM
Citation Stürzebecher, JPrasa, DHauptmann, JVieweg, HWikström, P Synthesis and structure-activity relationships of potent thrombin inhibitors: piperazides of 3-amidinophenylalanine. J Med Chem40:3091-9 (1997) 
 
Plasminogen
Name:Plasminogen
Type:Enzyme
Mol. Mass.:90579.18
Organism:Homo sapiens (Human)
Description:n/a
Residue:810
BDBM50060051
NameBDBM50060051
Synonyms:3-[3-(4-Acetyl-piperazin-1-yl)-2-(naphthalene-2-sulfonylamino)-3-oxo-propyl]-benzamidine | CHEMBL107188
TypeSmall organic molecule
Emp. Form.C26H29N5O4S
Mol. Mass.507.605
SMILESCC(=O)N1CCN(CC1)C(=O)C(Cc1cccc(c1)C(N)=N)NS(=O)(=O)c1ccc2ccccc2c1