Reaction Details
TargetDelta-type opioid receptor
LigandBDBM50060072
Substrate/Competitorn/a
Meas. Tech.ChEMBL_146474 (CHEMBL882767)
Kd 158±n/a nM
Citation Salvadori, SBalboni, GGuerrini, RTomatis, RBianchi, CBryant, SDCooper, PSLazarus, LH Evolution of the Dmt-Tic pharmacophore: N-terminal methylated derivatives with extraordinary delta opioid antagonist activity. J Med Chem40:3100-8 (1997) 
 
Delta-type opioid receptor
Name:Delta-type opioid receptor
Type:Enzyme Catalytic Domain
Mol. Mass.:40577.25
Organism:MOUSE
Description:P32300
Residue:372
BDBM50060072
NameBDBM50060072
Synonyms:2-[(R)-3-(4-Hydroxy-2,6-dimethyl-phenyl)-2-methylamino-propionyl]-1,2,3,4-tetrahydro-isoquinoline-3-carboxylic acid | CHEMBL107754
TypeSmall organic molecule
Emp. Form.C22H26N2O4
Mol. Mass.382.4528
SMILESCN[C@H](Cc1c(C)cc(O)cc1C)C(=O)N1Cc2ccccc2CC1C(O)=O