Reaction Details
TargetMu-type opioid receptor
LigandBDBM50060064
Substrate/Competitorn/a
Meas. Tech.ChEMBL_148849 (CHEMBL756645)
Ki 13089±n/a nM
Citation Salvadori, SBalboni, GGuerrini, RTomatis, RBianchi, CBryant, SDCooper, PSLazarus, LH Evolution of the Dmt-Tic pharmacophore: N-terminal methylated derivatives with extraordinary delta opioid antagonist activity. J Med Chem40:3100-8 (1997) 
 
Mu-type opioid receptor
Name:Mu-type opioid receptor
Type:G Protein-Coupled Receptor (GPCR)
Mol. Mass.:44503.11
Organism:Rattus norvegicus (rat)
Description:Competition binding assays were carried out using membrane preparations from transfected HN9.10 cells that constitutively expressed the mu opioid receptor.
Residue:398
BDBM50060064
NameBDBM50060064
Synonyms:2-[(R)-2-Dimethylamino-3-(4-hydroxy-2,6-dimethyl-phenyl)-propionyl]-1,2,3,4-tetrahydro-isoquinoline-3-carboxylic acid | CHEMBL318395
TypeSmall organic molecule
Emp. Form.C23H28N2O4
Mol. Mass.396.4794
SMILESCN(C)[C@H](Cc1c(C)cc(O)cc1C)C(=O)N1Cc2ccccc2CC1C(O)=O