Reaction Details
TargetProtein farnesyltransferase subunit beta/geranylgeranyltransferase type-1 subunit alpha
LigandBDBM50055594
Substrate/Competitorn/a
Meas. Tech.ChEMBL_70743 (CHEMBL681454)
IC50 48±n/a nM
Citation Leonard, DMShuler, KRPoulter, CJEaton, SRSawyer, TKHodges, JCSu, TZScholten, JDGowan, RCSebolt-Leopold, JSDoherty, AM Structure-activity relationships of cysteine-lacking pentapeptide derivatives that inhibit ras farnesyltransferase. J Med Chem40:192-200 (1997) 
 
Protein farnesyltransferase subunit beta/geranylgeranyltransferase type-1 subunit alpha
Name:Protein farnesyltransferase subunit beta/geranylgeranyltransferase type-1 subunit alpha
Type:n/a
Mol. Mass.:n/a
Description:ASSAY_ID of EBI is 69815
Components:This complex has 2 components.
Component 1
Name:Protein farnesyltransferase subunit beta
Synonyms:CAAX farnesyltransferase subunit beta FTase-beta Protein farnesyltransferase Ras proteins prenyltransferase subunit beta
Type:PROTEIN
Mol. Mass.:48666.41
Organism:Rattus norvegicus
Description:EBI_10573
Residue:437
Component 2
Name:Protein farnesyltransferase/geranylgeranyltransferase type-1 subunit alpha
Synonyms:CAAX farnesyltransferase alpha subunit FTase-alpha GGTase-I-alpha Protein farnesyltransferase/geranylgeranyltransferase type I alpha subunit Type I protein geranyl-geranyltransferase alpha subunit | geranylgeranyltransferase type-I
Type:Enzyme
Mol. Mass.:44030.14
Organism:Rattus norvegicus (rat)
Description:Recombinant rat enzyme.
Residue:377
BDBM50055594
NameBDBM50055594
Synonyms:(S)-2-[(R)-2-{(R)-3-Benzyloxy-2-[(R)-2-[(R)-2-benzyloxycarbonylamino-3-(1H-imidazol-4-yl)-propionylamino]-3-(4-benzyloxy-phenyl)-propionylamino]-propionylamino}-3-(1H-indol-3-yl)-propionylamino]-propionic acid methyl ester | CHEMBL266034
TypeSmall organic molecule
Emp. Form.C55H58N8O10
Mol. Mass.991.0966
SMILESCOC(=O)[C@H](C)NC(=O)[C@@H](Cc1c[nH]c2ccccc12)NC(=O)[C@@H](COCc1ccccc1)NC(=O)[C@@H](Cc1ccc(OCc2ccccc2)cc1)NC(=O)[C@@H](Cc1cnc[nH]1)NC(=O)OCc1ccccc1