Reaction Details
TargetProtein farnesyltransferase subunit beta/geranylgeranyltransferase type-1 subunit alpha
LigandBDBM50055614
Substrate/Competitorn/a
Meas. Tech.ChEMBL_70746 (CHEMBL681606)
IC50 49±n/a nM
Citation Leonard, DMShuler, KRPoulter, CJEaton, SRSawyer, TKHodges, JCSu, TZScholten, JDGowan, RCSebolt-Leopold, JSDoherty, AM Structure-activity relationships of cysteine-lacking pentapeptide derivatives that inhibit ras farnesyltransferase. J Med Chem40:192-200 (1997) 
 
Protein farnesyltransferase subunit beta/geranylgeranyltransferase type-1 subunit alpha
Name:Protein farnesyltransferase subunit beta/geranylgeranyltransferase type-1 subunit alpha
Type:n/a
Mol. Mass.:n/a
Description:ASSAY_ID of EBI is 69815
Components:This complex has 2 components.
Component 1
Name:Protein farnesyltransferase subunit beta
Synonyms:CAAX farnesyltransferase subunit beta FTase-beta Protein farnesyltransferase Ras proteins prenyltransferase subunit beta
Type:PROTEIN
Mol. Mass.:48666.41
Organism:Rattus norvegicus
Description:EBI_10573
Residue:437
Component 2
Name:Protein farnesyltransferase/geranylgeranyltransferase type-1 subunit alpha
Synonyms:CAAX farnesyltransferase alpha subunit FTase-alpha GGTase-I-alpha Protein farnesyltransferase/geranylgeranyltransferase type I alpha subunit Type I protein geranyl-geranyltransferase alpha subunit | geranylgeranyltransferase type-I
Type:Enzyme
Mol. Mass.:44030.14
Organism:Rattus norvegicus (rat)
Description:Recombinant rat enzyme.
Residue:377
BDBM50055614
NameBDBM50055614
Synonyms:(4-{2-{(R)-2-Benzyloxy-1-[(R)-1-((S)-1-carbamoyl-ethylcarbamoyl)-2-(1H-indol-3-yl)-ethylcarbamoyl]-ethylcarbamoyl}-2-[(R)-2-benzyloxycarbonylamino-3-(1H-imidazol-4-yl)-propionylamino]-ethyl}-benzyl)-phosphonic acid diethyl ester | CHEMBL385848
TypeSmall organic molecule
Emp. Form.C52H62N9O11P
Mol. Mass.1020.0761
SMILESCCOP(=O)(Cc1ccc(CC(NC(=O)[C@@H](Cc2cnc[nH]2)NC(=O)OCc2ccccc2)C(=O)N[C@H](COCc2ccccc2)C(=O)N[C@H](Cc2c[nH]c3ccccc23)C(=O)N[C@@H](C)C(N)=O)cc1)OCC