Reaction Details
TargetMu-type opioid receptor
LigandBDBM50218796
Substrate/Competitorn/a
Meas. Tech.ChEMBL_148398 (CHEMBL757106)
Ki 661±n/a nM
Citation Dondio, GRonzoni, SEggleston, DSArtico, MPetrillo, PPetrone, GVisentin, LFarina, CVecchietti, VClarke, GD Discovery of a novel class of substituted pyrrolooctahydroisoquinolines as potent and selective delta opioid agonists, based on an extension of the message-address concept. J Med Chem40:3192-8 (1997) 
 
Mu-type opioid receptor
Name:Mu-type opioid receptor
Type:Enzyme Catalytic Domain
Mol. Mass.:44431.62
Organism:MOUSE
Description:OPIATE Mu OPRM1 MOUSE::P42866
Residue:398
BDBM50218796
NameBDBM50218796
Synonyms:CHEMBL557978 oxymorphindole
TypeSmall organic molecule
Emp. Form.C23H22N2O3
Mol. Mass.374.4324
SMILESCN1CC[C@@]23[C@H]4Oc5c2c(C[C@@H]1[C@]3(O)Cc1c4[nH]c2ccccc12)ccc5O