Reaction Details
TargetKappa-type opioid receptor
LigandBDBM50061064
Substrate/Competitorn/a
Meas. Tech.ChEMBL_145563 (CHEMBL752652)
Ki 63±n/a nM
Citation Dondio, GRonzoni, SEggleston, DSArtico, MPetrillo, PPetrone, GVisentin, LFarina, CVecchietti, VClarke, GD Discovery of a novel class of substituted pyrrolooctahydroisoquinolines as potent and selective delta opioid agonists, based on an extension of the message-address concept. J Med Chem40:3192-8 (1997) 
 
Kappa-type opioid receptor
Name:Kappa-type opioid receptor
Type:Enzyme
Mol. Mass.:42656.78
Organism:Mus musculus (Mouse)
Description:P33534
Residue:380
BDBM50061064
NameBDBM50061064
Synonyms:(4aR,8aS)-6-Cyclopropylmethyl-8a-(3-hydroxy-phenyl)-3-methyl-4,4a,5,6,7,8,8a,9-octahydro-1H-pyrrolo[2,3-g]isoquinoline-2-carboxylic acid diethylamide | CHEMBL324236
TypeSmall organic molecule
Emp. Form.C27H37N3O2
Mol. Mass.435.6016
SMILESCCN(CC)C(=O)c1[nH]c2C[C@]3(CCN(CC4CC4)C[C@@H]3Cc2c1C)c1cccc(O)c1