Reaction Details
TargetSerine/threonine-protein phosphatase 2A 55 kDa regulatory subunit B
LigandBDBM50061066
Substrate/Competitorn/a
Meas. Tech.ChEMBL_161939 (CHEMBL769193)
IC50 0.20±n/a nM
Citation Gupta, VOgawa, AKDu, XHouk, KNArmstrong, RW A model for binding of structurally diverse natural product inhibitors of protein phosphatases PP1 and PP2A. J Med Chem40:3199-206 (1997) 
 
Serine/threonine-protein phosphatase 2A 55 kDa regulatory subunit B
Name:Serine/threonine-protein phosphatase 2A 55 kDa regulatory subunit B
Synonyms:Serine-threonine protein phosphatase 2A regulatory subunit
Type:PROTEIN
Mol. Mass.:49694.81
Organism:Gallus gallus
Description:ChEMBL_161937
Residue:426
BDBM50061066
NameBDBM50061066
TypeSmall organic molecule
Emp. Form.C41H60N8O10
Mol. Mass.824.9627
SMILESCO[C@@H](Cc1ccccc1)[C@@H](C)\C=C(/C)\C=C\[C@@H]1NC(=O)[C@H](CCCNC(N)=N)NC(=O)[C@@H](C)[C@@H](NC(=O)\C(=C\C)N(C)C(=O)CC[C@@H](NC(=O)[C@H]1C)C(O)=O)C(O)=O