Reaction Details
Target5-hydroxytryptamine receptor 3A/3B
LigandBDBM50060255
Substrate/Competitorn/a
Meas. Tech.ChEMBL_2997 (CHEMBL872925)
Ki>10000±n/a nM
Citation Heidempergher, FPillan, APinciroli, VVaghi, FArrigoni, CBolis, GCaccia, CDho, LMcArthur, RVarasi, M Phenylimidazolidin-2-one derivatives as selective 5-HT3 receptor antagonists and refinement of the pharmacophore model for 5-HT3 receptor binding. J Med Chem40:3369-80 (1997) 
 
5-hydroxytryptamine receptor 3A/3B
Name:5-hydroxytryptamine receptor 3A/3B
Type:n/a
Mol. Mass.:n/a
Description:ASSAY_ID of EBI is 2974
Components:This complex has 2 components.
Component 1
Name:5-hydroxytryptamine receptor 3B
Synonyms:5HT3B_RAT Serotonin (5-HT) receptor
Type:PROTEIN
Mol. Mass.:50328.78
Organism:Rattus norvegicus
Description:EBI_11885
Residue:437
Component 2
Name:5-hydroxytryptamine receptor 3A
Synonyms:5-HT3 5HT3A_RAT Htr3 Serotonin (5-HT) receptor | Zacopride site-R
Type:Enzyme Catalytic Domain
Mol. Mass.:55428.70
Organism:RAT
Description:5-HT3 HTR3A RAT::P35563
Residue:483
BDBM50060255
NameBDBM50060255
Synonyms:1-(3-Chloro-phenyl)-3-(8-methyl-8-aza-bicyclo[3.2.1]oct-3-yl)-imidazolidin-2-one | CHEMBL324719
TypeSmall organic molecule
Emp. Form.C17H22ClN3O
Mol. Mass.319.829
SMILESCN1C2CCC1CC(C2)N1CCN(C1=O)c1cccc(Cl)c1