Reaction Details
TargetL-selectin
LigandBDBM50450369
Substrate/Competitorn/a
Meas. Tech.ChEMBL_199996 (CHEMBL810880)
IC50>1000000±n/a nM
Citation Tsukida, THiramatsu, YTsujishita, HKiyoi, TYoshida, MKurokawa, KMoriyama, HOhmoto, HWada, YSaito, TKondo, H Studies on selection blockers. 5. Design, synthesis, and biological profile of sialyl Lewis x mimetics based on modified serine-glutamic acid dipeptides. J Med Chem40:3534-41 (1997) 
 
L-selectin
Name:L-selectin
Type:PROTEIN
Mol. Mass.:42288.63
Organism:Mus musculus
Description:ChEMBL_199996
Residue:372
BDBM50450369
NameBDBM50450369
Synonyms:SIALYL LEWIS X Sialyl lewis-x sialyl LewisX
TypeSmall organic molecule
Emp. Form.C31H52N2O23
Mol. Mass.820.7442
SMILES[H][C@]1(O[C@@](C[C@H](O)[C@H]1NC(C)=O)(O[C@H]1[C@@H](O)[C@@H](CO)O[C@@H](O[C@H]([C@H](O)CO)[C@H](O[C@@H]2O[C@@H](C)[C@@H](O)[C@@H](O)[C@@H]2O)[C@@H](NC(C)=O)C=O)[C@@H]1O)C(O)=O)[C@H](O)[C@H](O)CO