Reaction Details
TargetE-selectin
LigandBDBM50060515
Substrate/Competitorn/a
Meas. Tech.ChEMBL_199837 (CHEMBL805735)
IC50>1000000±n/a nM
Citation Tsukida, THiramatsu, YTsujishita, HKiyoi, TYoshida, MKurokawa, KMoriyama, HOhmoto, HWada, YSaito, TKondo, H Studies on selection blockers. 5. Design, synthesis, and biological profile of sialyl Lewis x mimetics based on modified serine-glutamic acid dipeptides. J Med Chem40:3534-41 (1997) 
 
E-selectin
Name:E-selectin
Type:PROTEIN
Mol. Mass.:66749.86
Organism:Mus musculus
Description:ChEMBL_199837
Residue:612
BDBM50060515
NameBDBM50060515
Synonyms:(S)-4-Methylcarbamoyl-4-[(S)-2-(2-tetradecyl-hexadecanoylamino)-3-(3,4,5-trihydroxy-6-methyl-tetrahydro-pyran-2-yloxy)-propionylamino]-butyric acid CHEMBL76801
TypeSmall organic molecule
Emp. Form.C45H85N3O10
Mol. Mass.828.1705
(CCCCCCCCCCCCCC)C(=O)N[C@@H](COC1OC(C)C(O)C(O)C1O)C(=O)N[C@@H](CCC(O)=O)C(=O)NC