Reaction Details
TargetE-selectin
LigandBDBM50408284
Substrate/Competitorn/a
Meas. Tech.ChEMBL_199837 (CHEMBL805735)
IC50 280000±n/a nM
Citation Tsukida, THiramatsu, YTsujishita, HKiyoi, TYoshida, MKurokawa, KMoriyama, HOhmoto, HWada, YSaito, TKondo, H Studies on selection blockers. 5. Design, synthesis, and biological profile of sialyl Lewis x mimetics based on modified serine-glutamic acid dipeptides. J Med Chem40:3534-41 (1997) 
 
E-selectin
Name:E-selectin
Type:PROTEIN
Mol. Mass.:66749.86
Organism:Mus musculus
Description:ChEMBL_199837
Residue:612
BDBM50408284
NameBDBM50408284
Synonyms:CHEMBL2029056
TypeSmall organic molecule
Emp. Form.C48H91O18S
Mol. Mass.988.291
(CCCCCCCCCCCCCC)CO[C@@H]1O[C@H](CO)[C@@H](O[C@@H]2O[C@H](CO)[C@H](O)[C@H](OS([O-])(=O)=O)[C@H]2O)[C@H](O[C@@H]2O[C@@H](C)[C@@H](O)[C@@H](O)[C@@H]2O)[C@H]1O