Reaction Details
TargetAdenosine receptor A1
LigandBDBM50454666
Substrate/Competitorn/a
Meas. Tech.ChEMBL_28848 (CHEMBL646710)
Ki 81±n/a nM
Citation Van Calenbergh, Svon Frijtag Drabbe Künzel, JKBlaton, NMPeeters, OMRozenski, JVan Aerschot, ADe Bruyn, ADe Keukeleire, DIJzerman, APHerdewijn, P N6-cyclopentyl-3'-substituted-xylofuranosyladenosines: a new class of non-xanthine adenosine A1 receptor antagonists. J Med Chem40:3765-72 (1997) 
 
Adenosine receptor A1
Name:Adenosine receptor A1
Type:Protein
Mol. Mass.:36704.13
Organism:Rattus norvegicus (rat)
Description:n/a
Residue:326
BDBM50454666
NameBDBM50454666
Synonyms:CHEMBL2112627
TypeSmall organic molecule
Emp. Form.C22H25ClN6O4
Mol. Mass.472.925
SMILESOC[C@H]1O[C@H]([C@H](O)[C@H]1NC(=O)c1ccc(Cl)cc1)n1cnc2c(NC3CCCC3)ncnc12