Reaction Details
TargetD(2) dopamine receptor
LigandBDBM50061642
Substrate/Competitorn/a
Meas. Tech.ChEMBL_62884 (CHEMBL673594)
Ki 0.400000±n/a nM
Citation Mewshaw, REKavanagh, JStack, GMarquis, KLShi, XKagan, MZWebb, MBKatz, AHPark, AKang, YHAbou-Gharbia, MScerni, RWasik, TCortes-Burgos, LSpangler, TBrennan, JAPiesla, MMazandarani, HCockett, MIOchalski, RCoupet, JAndree, TH New generation dopaminergic agents. 1. Discovery of a novel scaffold which embraces the D2 agonist pharmacophore. Structure-activity relationships of a series of 2-(aminomethyl)chromans. J Med Chem40:4235-56 (1998) 
 
D(2) dopamine receptor
Name:D(2) dopamine receptor
Type:G Protein-Coupled Receptor (GPCR)
Mol. Mass.:50931.60
Organism:Rattus norvegicus (rat)
Description:P61169
Residue:444
BDBM50061642
NameBDBM50061642
Synonyms:(S)-3-(Benzylamino-methyl)-2,3-dihydro-benzo[1,4]dioxin-6-ol; oxalic acid CHEMBL423890
TypeSmall organic molecule
Emp. Form.C16H17NO3
Mol. Mass.271.3111
SMILESOc1ccc2OC[C@H](CNCc3ccccc3)Oc2c1