Reaction Details
TargetD(2) dopamine receptor
LigandBDBM50061640
Substrate/Competitorn/a
Meas. Tech.ChEMBL_62884 (CHEMBL673594)
Ki 0.600000±n/a nM
Citation Mewshaw, REKavanagh, JStack, GMarquis, KLShi, XKagan, MZWebb, MBKatz, AHPark, AKang, YHAbou-Gharbia, MScerni, RWasik, TCortes-Burgos, LSpangler, TBrennan, JAPiesla, MMazandarani, HCockett, MIOchalski, RCoupet, JAndree, TH New generation dopaminergic agents. 1. Discovery of a novel scaffold which embraces the D2 agonist pharmacophore. Structure-activity relationships of a series of 2-(aminomethyl)chromans. J Med Chem40:4235-56 (1998) 
 
D(2) dopamine receptor
Name:D(2) dopamine receptor
Type:G Protein-Coupled Receptor (GPCR)
Mol. Mass.:50931.60
Organism:Rattus norvegicus (rat)
Description:P61169
Residue:444
BDBM50061640
NameBDBM50061640
Synonyms:(R)-2-(Benzylamino-methyl)-6-chloro-chroman-7-ol; oxalic acid | CHEMBL135357
TypeSmall organic molecule
Emp. Form.C17H18ClNO2
Mol. Mass.303.783
SMILESOc1cc2O[C@@H](CNCc3ccccc3)CCc2cc1Cl