Reaction Details
Target5-hydroxytryptamine receptor 1A
LigandBDBM50061646
Substrate/Competitorn/a
Meas. Tech.ChEMBL_1413 (CHEMBL616201)
Ki 0.30±n/a nM
Citation Mewshaw, REKavanagh, JStack, GMarquis, KLShi, XKagan, MZWebb, MBKatz, AHPark, AKang, YHAbou-Gharbia, MScerni, RWasik, TCortes-Burgos, LSpangler, TBrennan, JAPiesla, MMazandarani, HCockett, MIOchalski, RCoupet, JAndree, TH New generation dopaminergic agents. 1. Discovery of a novel scaffold which embraces the D2 agonist pharmacophore. Structure-activity relationships of a series of 2-(aminomethyl)chromans. J Med Chem40:4235-56 (1998) 
 
5-hydroxytryptamine receptor 1A
Name:5-hydroxytryptamine receptor 1A
Type:G Protein-Coupled Receptor (GPCR)
Mol. Mass.:46445.29
Organism:Rattus norvegicus (rat)
Description:Binding assays were performed using rat hippocampal membranes.
Residue:422
BDBM50061646
NameBDBM50061646
Synonyms:2-{[3-(3-Methyl-benzo[d]isoxazol-6-yloxy)-propylamino]-methyl}-chroman-7-ol; oxalic acid | CHEMBL134930
TypeSmall organic molecule
Emp. Form.C21H24N2O4
Mol. Mass.368.4263
SMILESCc1noc2cc(OCCCNCC3CCc4ccc(O)cc4O3)ccc12