Reaction Details
TargetGastrin/cholecystokinin type B receptor
LigandBDBM50061829
Substrate/Competitorn/a
Meas. Tech.ChEMBL_48603 (CHEMBL656926)
Ki 1600±n/a nM
Citation Pierson, MEComstock, JMSimmons, RDKaiser, FJulien, RZongrone, JRosamond, JD Synthesis and biological evaluation of potent, selective, hexapeptide CCK-A agonist anorectic agents. J Med Chem40:4302-7 (1998) 
 
Gastrin/cholecystokinin type B receptor
Name:Gastrin/cholecystokinin type B receptor
Type:Enzyme Catalytic Domain
Mol. Mass.:48980.43
Organism:RAT
Description:Cholecystokinin A CCKBR RAT::P30553
Residue:452
BDBM50061829
NameBDBM50061829
Synonyms:(R)-N-((S)-1-Carbamoyl-2-phenyl-ethyl)-3-({(S)-2-[(S)-3-(1H-indol-3-yl)-2-(2-{(S)-2-[2-(4-sulfooxy-phenyl)-acetylamino]-hexanoylamino}-acetylamino)-propionylamino]-hexanoyl}-methyl-amino)-succinamic acid | CHEMBL423907
TypeSmall organic molecule
Emp. Form.C47H60N8O13S
Mol. Mass.977.09
SMILESCCCC[C@H](NC(=O)Cc1ccc(OS(O)(=O)=O)cc1)C(=O)NCC(=O)N[C@@H](Cc1c[nH]c2ccccc12)C(=O)N[C@@H](CCCC)C(=O)N(C)[C@H](CC(O)=O)C(=O)N[C@@H](Cc1ccccc1)C(N)=O