Reaction Details
Target5-hydroxytryptamine receptor 4
LigandBDBM50056393
Substrate/Competitorn/a
Meas. Tech.ChEMBL_3253 (CHEMBL619759)
IC50 100±n/a nM
Citation Yang, DSoulier, JLSicsic, SMathé-Allainmat, MBrémont, BCroci, TCardamone, RAureggi, GLanglois, M New esters of 4-amino-5-chloro-2-methoxybenzoic acid as potent agonists and antagonists for 5-HT4 receptors. J Med Chem40:608-21 (1997) 
 
5-hydroxytryptamine receptor 4
Name:5-hydroxytryptamine receptor 4
Type:Enzyme Catalytic Domain
Mol. Mass.:43735.29
Organism:GUINEA PIG
Description:5-HT4 HTR4 GUINEA PIG::O70528
Residue:388
BDBM50056393
NameBDBM50056393
Synonyms:4-Amino-5-chloro-2-methoxy-benzoic acid 2-(4-phenyl-piperazin-1-yl)-ethyl ester | CHEMBL123377
TypeSmall organic molecule
Emp. Form.C20H24ClN3O3
Mol. Mass.389.876
SMILESCOc1cc(N)c(Cl)cc1C(=O)OCCN1CCN(CC1)c1ccccc1