Reaction Details
Target5-hydroxytryptamine receptor 3A/3B
LigandBDBM50056392
Substrate/Competitorn/a
Meas. Tech.ChEMBL_2981 (CHEMBL621308)
Ki>1000±n/a nM
Citation Yang, DSoulier, JLSicsic, SMathé-Allainmat, MBrémont, BCroci, TCardamone, RAureggi, GLanglois, M New esters of 4-amino-5-chloro-2-methoxybenzoic acid as potent agonists and antagonists for 5-HT4 receptors. J Med Chem40:608-21 (1997) 
 
5-hydroxytryptamine receptor 3A/3B
Name:5-hydroxytryptamine receptor 3A/3B
Type:n/a
Mol. Mass.:n/a
Description:ASSAY_ID of EBI is 2974
Components:This complex has 2 components.
Component 1
Name:5-hydroxytryptamine receptor 3B
Synonyms:5HT3B_RAT Serotonin (5-HT) receptor
Type:PROTEIN
Mol. Mass.:50328.78
Organism:Rattus norvegicus
Description:EBI_11885
Residue:437
Component 2
Name:5-hydroxytryptamine receptor 3A
Synonyms:5-HT3 5HT3A_RAT Htr3 Serotonin (5-HT) receptor | Zacopride site-R
Type:Enzyme Catalytic Domain
Mol. Mass.:55428.70
Organism:RAT
Description:5-HT3 HTR3A RAT::P35563
Residue:483
BDBM50056392
NameBDBM50056392
Synonyms:4-Amino-5-chloro-2-methoxy-benzoic acid 2-(3,5-dimethyl-piperidin-1-yl)-ethyl ester | CHEMBL155917
TypeSmall organic molecule
Emp. Form.C17H25ClN2O3
Mol. Mass.340.845
SMILESCOc1cc(N)c(Cl)cc1C(=O)OCCN1CC(C)CC(C)C1