Reaction Details
Target5-hydroxytryptamine receptor 4
LigandBDBM50056396
Substrate/Competitorn/a
Meas. Tech.ChEMBL_3340 (CHEMBL619040)
Ki 91±n/a nM
Citation Yang, DSoulier, JLSicsic, SMathé-Allainmat, MBrémont, BCroci, TCardamone, RAureggi, GLanglois, M New esters of 4-amino-5-chloro-2-methoxybenzoic acid as potent agonists and antagonists for 5-HT4 receptors. J Med Chem40:608-21 (1997) 
 
5-hydroxytryptamine receptor 4
Name:5-hydroxytryptamine receptor 4
Type:Enzyme Catalytic Domain
Mol. Mass.:46117.31
Organism:RAT
Description:5-HT4 HTR4 RAT::Q62758
Residue:406
BDBM50056396
NameBDBM50056396
Synonyms:4-Amino-5-chloro-2-methoxy-benzoic acid (S)-(1-aza-bicyclo[2.2.2]oct-3-yl) ester | CHEMBL288199
TypeSmall organic molecule
Emp. Form.C15H19ClN2O3
Mol. Mass.310.776
SMILESCOc1cc(N)c(Cl)cc1C(=O)O[C@@H]1CN2CCC1CC2