Reaction Details
Target5-hydroxytryptamine receptor 4
LigandBDBM29526
Substrate/Competitorn/a
Meas. Tech.ChEMBL_3340 (CHEMBL619040)
Ki 1.1±n/a nM
Citation Yang, DSoulier, JLSicsic, SMathé-Allainmat, MBrémont, BCroci, TCardamone, RAureggi, GLanglois, M New esters of 4-amino-5-chloro-2-methoxybenzoic acid as potent agonists and antagonists for 5-HT4 receptors. J Med Chem40:608-21 (1997) 
 
5-hydroxytryptamine receptor 4
Name:5-hydroxytryptamine receptor 4
Type:Enzyme Catalytic Domain
Mol. Mass.:46117.31
Organism:RAT
Description:5-HT4 HTR4 RAT::Q62758
Residue:406
BDBM29526
NameBDBM29526
Synonyms:2-Piperidinoethyl 4-amino-5-chloro-2-methoxybenzoate ML 10302 | ML10302
TypeSmall organic molecule
Emp. Form.C15H21ClN2O3
Mol. Mass.312.792
SMILESCOc1cc(N)c(Cl)cc1C(=O)OCCN1CCCCC1