Reaction Details
Target5-hydroxytryptamine receptor 4
LigandBDBM50056401
Substrate/Competitorn/a
Meas. Tech.ChEMBL_3340 (CHEMBL619040)
Ki 5.5±n/a nM
Citation Yang, DSoulier, JLSicsic, SMathé-Allainmat, MBrémont, BCroci, TCardamone, RAureggi, GLanglois, M New esters of 4-amino-5-chloro-2-methoxybenzoic acid as potent agonists and antagonists for 5-HT4 receptors. J Med Chem40:608-21 (1997) 
 
5-hydroxytryptamine receptor 4
Name:5-hydroxytryptamine receptor 4
Type:Enzyme Catalytic Domain
Mol. Mass.:46117.31
Organism:RAT
Description:5-HT4 HTR4 RAT::Q62758
Residue:406
BDBM50056401
NameBDBM50056401
Synonyms:2-diethylaminoethyl [2-methoxy-4-amino-5-chloro]benzoate CHEMBL287045 SDZ-205557
TypeSmall organic molecule
Emp. Form.C14H21ClN2O3
Mol. Mass.300.781
SMILESCCN(CC)CCOC(=O)c1cc(Cl)c(N)cc1OC