Reaction Details
Target5-hydroxytryptamine receptor 4
LigandBDBM82519
Substrate/Competitorn/a
Meas. Tech.ChEMBL_3340 (CHEMBL619040)
Ki 49±n/a nM
Citation Yang, DSoulier, JLSicsic, SMathé-Allainmat, MBrémont, BCroci, TCardamone, RAureggi, GLanglois, M New esters of 4-amino-5-chloro-2-methoxybenzoic acid as potent agonists and antagonists for 5-HT4 receptors. J Med Chem40:608-21 (1997) 
 
5-hydroxytryptamine receptor 4
Name:5-hydroxytryptamine receptor 4
Type:Enzyme Catalytic Domain
Mol. Mass.:46117.31
Organism:RAT
Description:5-HT4 HTR4 RAT::Q62758
Residue:406
BDBM82519
NameBDBM82519
Synonyms:4-amino-5-chloro-2-methoxy-N-(8-methyl-8-azabicyclo[3.2.1]octan-3-yl)benzamide CAS_76272-78-1
TypeSmall organic molecule
Emp. Form.C16H22ClN3O2
Mol. Mass.323.818
SMILES[H]C12CCC([H])(CC(C1)NC(=O)c1cc(Cl)c(N)cc1OC)N2C