Reaction Details
Target5-hydroxytryptamine receptor 4
LigandBDBM50056418
Substrate/Competitorn/a
Meas. Tech.ChEMBL_3340 (CHEMBL619040)
Ki 0.92±n/a nM
Citation Yang, DSoulier, JLSicsic, SMathé-Allainmat, MBrémont, BCroci, TCardamone, RAureggi, GLanglois, M New esters of 4-amino-5-chloro-2-methoxybenzoic acid as potent agonists and antagonists for 5-HT4 receptors. J Med Chem40:608-21 (1997) 
 
5-hydroxytryptamine receptor 4
Name:5-hydroxytryptamine receptor 4
Type:Enzyme Catalytic Domain
Mol. Mass.:46117.31
Organism:RAT
Description:5-HT4 HTR4 RAT::Q62758
Residue:406
BDBM50056418
NameBDBM50056418
Synonyms:4-Amino-5-chloro-2-methoxy-benzoic acid 2-azepan-1-yl-ethyl ester | CHEMBL348311
TypeSmall organic molecule
Emp. Form.C16H23ClN2O3
Mol. Mass.326.818
SMILESCOc1cc(N)c(Cl)cc1C(=O)OCCN1CCCCCC1