Reaction Details
Target5-hydroxytryptamine receptor 4
LigandBDBM50056422
Substrate/Competitorn/a
Meas. Tech.ChEMBL_3340 (CHEMBL619040)
Ki 6.3±n/a nM
Citation Yang, DSoulier, JLSicsic, SMathé-Allainmat, MBrémont, BCroci, TCardamone, RAureggi, GLanglois, M New esters of 4-amino-5-chloro-2-methoxybenzoic acid as potent agonists and antagonists for 5-HT4 receptors. J Med Chem40:608-21 (1997) 
 
5-hydroxytryptamine receptor 4
Name:5-hydroxytryptamine receptor 4
Type:Enzyme Catalytic Domain
Mol. Mass.:46117.31
Organism:RAT
Description:5-HT4 HTR4 RAT::Q62758
Residue:406
BDBM50056422
NameBDBM50056422
Synonyms:4-Amino-5-chloro-2-methoxy-benzoic acid 2-(2,6-dimethyl-morpholin-4-yl)-ethyl ester | CHEMBL351570
TypeSmall organic molecule
Emp. Form.C16H23ClN2O4
Mol. Mass.342.818
SMILESCOc1cc(N)c(Cl)cc1C(=O)OCCN1CC(C)OC(C)C1