Reaction Details
TargetCannabinoid receptor 1
LigandBDBM50454796
Substrate/Competitorn/a
Meas. Tech.ChEMBL_46811 (CHEMBL659697)
Ki 191±n/a nM
Citation Sheskin, THanus, LSlager, JVogel, ZMechoulam, R Structural requirements for binding of anandamide-type compounds to the brain cannabinoid receptor. J Med Chem40:659-67 (1997) 
 
Cannabinoid receptor 1
Name:Cannabinoid receptor 1
Type:G Protein-Coupled Receptor (GPCR)
Mol. Mass.:52856.55
Organism:Rattus norvegicus (rat)
Description:P20272
Residue:473
BDBM50454796
NameBDBM50454796
Synonyms:CHEMBL2110296
TypeSmall organic molecule
Emp. Form.C25H43NO2
Mol. Mass.389.6144
SMILESCCCCC\C=C/C\C=C/C\C=C/C\C=C/CCC(C)(C)C(=O)N[C@@H](C)CO